-
 KDE-Apps.org Applications for the KDE-Desktop 
 GTK-Apps.org Applications using the GTK Toolkit 
 GnomeFiles.org Applications for GNOME 
 MeeGo-Central.org Applications for MeeGo 
 CLI-Apps.org Command Line Applications 
 Qt-Apps.org Free Qt Applications 
 Qt-Prop.org Proprietary Qt Applications 
 Maemo-Apps.org Applications for the Maemo Plattform 
 Java-Apps.org Free Java Applications 
 eyeOS-Apps.org Free eyeOS Applications 
 Wine-Apps.org Wine Applications 
 Server-Apps.org Server Applications 
 apps.ownCloud.com ownCloud Applications 
--
-
 KDE-Look.org Artwork for the KDE-Desktop 
 GNOME-Look.org Artwork for the GNOME-Desktop 
 Xfce-Look.org Artwork for the Xfce-Desktop 
 Box-Look.org Artwork for your Windowmanager 
 E17-Stuff.org Artwork for Enlightenment 
 Beryl-Themes.org Artwork for the Beryl Windowmanager 
 Compiz-Themes.org Artwork for the Compiz Windowmanager 
 EDE-Look.org Themes for your EDE Desktop 
--
-
 Debian-Art.org Stuff for Debian 
 Gentoo-Art.org Artwork for Gentoo Linux 
 SUSE-Art.org Artwork for openSUSE 
 Ubuntu-Art.org Artwork for Ubuntu 
 Kubuntu-Art.org Artwork for Kubuntu 
 LinuxMint-Art.org Artwork for Linux Mint 
 Arch-Stuff.org Art And Stuff for Arch Linux 
 Frugalware-Art.org Themes for Frugalware 
 Fedora-Art.org Artwork for Fedora Linux 
 Mandriva-Art.org Artwork for Mandriva Linux 
--
-
 KDE-Files.org Files for KDE Applications 
 OpenTemplate.org Documents for OpenOffice.org
 GIMPStuff.org Files for GIMP
 InkscapeStuff.org Files for Inkscape
 ScribusStuff.org Files for Scribus
 BlenderStuff.org Textures and Objects for Blender
 VLC-Addons.org Themes and Extensions for VLC
--
-
 KDE-Help.org Support for your KDE Desktop 
 GNOME-Help.org Support for your GNOME Desktop 
 Xfce-Help.org Support for your Xfce Desktop 
--
openDesktop.orgopenDesktop.org:   Applications   Artwork   Linux Distributions   Documents    LinuxDaily.com    Linux42.org    OpenSkillz.com   
 
Apps
News
Groups
Knowledge
Events
Forum
People
Jobs
Register
Login


Sponsoring


-
- Content .- Fans  .- Knowledge Base  . 

blaKjaK

   1.0  

Plasmoid Binary

Score 50%
Minimum required   KDE 4.x
Downloads:  18
Submitted:  Aug 13 2010

Description:

A KDE plasmoid ment for quick games of Black Jack, 21 or whatever you may call it.

Use \'A\' to hit, \'S\' to sat and \'D\' to start a new game.

This is my first plasmoid and new feature suggestions are welcome!




LicenseGPL
Source
Send to a friend
Subscribe
Other  Apps  from werevire
Report inappropriate content



-

 Nice, but issues

 
 by Vistausss on: Aug 13 2010
 
Score 50%
VistausssVistausss
Ubukuntu/Ubu ntu-NL
Home
-
Heimen Stoffels -3

Ubukuntu/Ubuntu-NL
Netherlands, Almere
Last visit Aug 2 2012
1 Friends
5 Groups

More info
Send a message
Add as friend
Other contents
--

1 Maybe a little screenshot? :)
2 I get an error while compiling:

[100%] Building CXX object CMakeFiles/plasma_applet_blakjak.dir/blakjak.o
In file included from /home/vistausss/Downloads/blakjak/blakjak.cpp:19:
/home/vistausss/Downloads/blakjak/blakjak.h:23:23: error: cardcache.h: Bestand of map bestaat niet
/home/vistausss/Downloads/blakjak/blakjak.cpp:29:23: error: KCardDialog: Bestand of map bestaat niet
/home/vistausss/Downloads/blakjak/blakjak.cpp:30:26: error: carddeckinfo.h: Bestand of map bestaat niet
In file included from /home/vistausss/Downloads/blakjak/blakjak.cpp:19:
/home/vistausss/Downloads/blakjak/blakjak.h:68: error: ISO C++ forbids declaration of ‘KCardCache’ with no type
/home/vistausss/Downloads/blakjak/blakjak.h:68: error: expected ‘;’ before ‘*’ token
/home/vistausss/Downloads/blakjak/blakjak.h:69: error: ‘KCardInfo’ was not declared in this scope
/home/vistausss/Downloads/blakjak/blakjak.h:69: error: template argument 1 is invalid
/home/vistausss/Downloads/blakjak/blakjak.h:70: error: ‘KCardInfo’ was not declared in this scope
/home/vistausss/Downloads/blakjak/blakjak.h:70: error: template argument 1 is invalid
/home/vistausss/Downloads/blakjak/blakjak.h:78: error: ‘KCardInfo’ does not name a type
/home/vistausss/Downloads/blakjak/blakjak.h:80: error: ‘KCardInfo’ was not declared in this scope
/home/vistausss/Downloads/blakjak/blakjak.h:80: error: template argument 1 is invalid
/home/vistausss/Downloads/blakjak/blakjak.cpp: In constructor ‘blaKjaK::blaKjaK(QObject*, const QVariantList&)’:
/home/vistausss/Downloads/blakjak/blakjak.cpp:36: error: class ‘blaKjaK’ does not have any field named ‘_cache’
/home/vistausss/Downloads/blakjak/blakjak.cpp:36: error: expected type-specifier before ‘KCardCache’
/home/vistausss/Downloads/blakjak/blakjak.cpp:36: error: expected ‘)’ before ‘KCardCache’
/home/vistausss/Downloads/blakjak/blakjak.cpp:41: error: ‘_cache’ was not declared in this scope
/home/vistausss/Downloads/blakjak/blakjak.cpp: In destructor ‘virtual blaKjaK::~blaKjaK()’:
/home/vistausss/Downloads/blakjak/blakjak.cpp:52: error: ‘_cache’ was not declared in this scope
/home/vistausss/Downloads/blakjak/blakjak.cpp: In member function ‘virtual void blaKjaK::init()’:
/home/vistausss/Downloads/blakjak/blakjak.cpp:78: error: invalid use of incomplete type ‘struct KCardWidget’
/home/vistausss/Downloads/blakjak/blakjak.h:26: error: forward declaration of ‘struct KCardWidget’
/home/vistausss/Downloads/blakjak/blakjak.cpp:79: error: invalid use of incomplete type ‘struct KCardWidget’
/home/vistausss/Downloads/blakjak/blakjak.h:26: error: forward declaration of ‘struct KCardWidget’
/home/vistausss/Downloads/blakjak/blakjak.cpp:80: error: ‘_cache’ was not declared in this scope
/home/vistausss/Downloads/blakjak/blakjak.cpp:80: error: invalid use of incomplete type ‘struct KCardWidget’
/home/vistausss/Downloads/blakjak/blakjak.h:26: error: forward declaration of ‘struct KCardWidget’
/home/vistausss/Downloads/blakjak/blakjak.cpp:81: error: invalid use of incomplete type ‘struct KCardWidget’
/home/vistausss/Downloads/blakjak/blakjak.h:26: error: forward declaration of ‘struct KCardWidget’
/home/vistausss/Downloads/blakjak/blakjak.cpp: In member function ‘virtual void blaKjaK::paintInterface(QPainter*, const QStyleOptionGraphicsItem*, const QRect&)’:
/home/vistausss/Downloads/blakjak/blakjak.cpp:97: error: ‘_cache’ was not declared in this scope
/home/vistausss/Downloads/blakjak/blakjak.cpp:99: error: request for member ‘size’ in ‘((blaKjaK*)this)->blaKjaK::_playersHand’, which is of non-class type ‘int’
/home/vistausss/Downloads/blakjak/blakjak.cpp:99: error: request for member ‘size’ in ‘((blaKjaK*)this)->blaKjaK::_dealersHand’, which is of non-class type ‘int’
/home/vistausss/Downloads/blakjak/blakjak.cpp:103: error: invalid types ‘int[quint8]’ for array subscript
/home/vistausss/Downloads/blakjak/blakjak.cpp:110: error: invalid types ‘int[quint8]’ for array subscript
/home/vistausss/Downloads/blakjak/blakjak.cpp:119: error: invalid types ‘int[int]’ for array subscript
/home/vistausss/Downloads/blakjak/blakjak.cpp: In member function ‘virtual void blaKjaK::createConfigurationInterface(KConfigDialog*)’:
/home/vistausss/Downloads/blakjak/blakjak.cpp:125: error: invalid use of incomplete type ‘struct KCardWidget’
/home/vistausss/Downloads/blakjak/blakjak.h:26: error: forward declaration of ‘struct KCardWidget’
/home/vistausss/Downloads/blakjak/blakjak.cpp:126: error: invalid use of incomplete type ‘struct KCardWidget’
/home/vistausss/Downloads/blakjak/blakjak.h:26: error: forward declaration of ‘struct KCardWidget’
/home/vistausss/Downloads/blakjak/blakjak.cpp:126: error: ‘_cache’ was not declared in this scope
/home/vistausss/Downloads/blakjak/blakjak.cpp:127: error: invalid use of incomplete type ‘struct KCardWidget’
/home/vistausss/Downloads/blakjak/blakjak.h:26: error: forward declaration of ‘struct KCardWidget’
/home/vistausss/Downloads/blakjak/blakjak.cpp:128: error: no matching function for call to ‘KConfigDialog::addPage(KCardWidget*&, QString, QString)’
/usr/include/KDE/../kconfigdialog.h:124: note: candidates are: KPageWidgetItem* KConfigDialog::addPage(QWidget*, const QString&, const QString&, const QString&, bool)
/usr/include/KDE/../kconfigdialog.h:144: note: KPageWidgetItem* KConfigDialog::addPage(QWidget*, KConfigSkeleton*, const QString&, const QString&, const QString&)
/home/vistausss/Downloads/blakjak/blakjak.cpp: In member function ‘void blaKjaK::applyNewConfig()’:
/home/vistausss/Downloads/blakjak/blakjak.cpp:143: error: ‘_cache’ was not declared in this scope
/home/vistausss/Downloads/blakjak/blakjak.cpp:143: error: invalid use of incomplete type ‘struct KCardWidget’
/home/vistausss/Downloads/blakjak/blakjak.h:26: error: forward declaration of ‘struct KCardWidget’
/home/vistausss/Downloads/blakjak/blakjak.cpp:144: error: invalid use of incomplete type ‘struct KCardWidget’
/home/vistausss/Downloads/blakjak/blakjak.h:26: error: forward declaration of ‘struct KCardWidget’
/home/vistausss/Downloads/blakjak/blakjak.cpp:152: error: invalid use of incomplete type ‘struct KCardWidget’
/home/vistausss/Downloads/blakjak/blakjak.h:26: error: forward declaration of ‘struct KCardWidget’
/home/vistausss/Downloads/blakjak/blakjak.cpp: In member function ‘void blaKjaK::deal()’:
/home/vistausss/Downloads/blakjak/blakjak.cpp:193: error: request for member ‘clear’ in ‘((blaKjaK*)this)->blaKjaK::_playersHand’, which is of non-class type ‘int’
/home/vistausss/Downloads/blakjak/blakjak.cpp:194: error: request for member ‘clear’ in ‘((blaKjaK*)this)->blaKjaK::_dealersHand’, which is of non-class type ‘int’
/home/vistausss/Downloads/blakjak/blakjak.cpp:197: error: request for member ‘append’ in ‘((blaKjaK*)this)->blaKjaK::_playersHand’, which is of non-class type ‘int’
/home/vistausss/Downloads/blakjak/blakjak.cpp:197: error: ‘dealCard’ was not declared in this scope
/home/vistausss/Downloads/blakjak/blakjak.cpp:199: error: request for member ‘append’ in ‘((blaKjaK*)this)->blaKjaK::_dealersHand’, which is of non-class type ‘int’
/home/vistausss/Downloads/blakjak/blakjak.cpp:199: error: ‘dealCard’ was not declared in this scope
/home/vistausss/Downloads/blakjak/blakjak.cpp: In member function ‘void blaKjaK::hit()’:
/home/vistausss/Downloads/blakjak/blakjak.cpp:212: error: request for member ‘append’ in ‘((blaKjaK*)this)->blaKjaK::_playersHand’, which is of non-class type ‘int’
/home/vistausss/Downloads/blakjak/blakjak.cpp:212: error: ‘dealCard’ was not declared in this scope
/home/vistausss/Downloads/blakjak/blakjak.cpp: In member function ‘void blaKjaK::stay()’:
/home/vistausss/Downloads/blakjak/blakjak.cpp:221: error: request for member ‘append’ in ‘((blaKjaK*)this)->blaKjaK::_dealersHand’, which is of non-class type ‘int’
/home/vistausss/Downloads/blakjak/blakjak.cpp:221: error: ‘dealCard’ was not declared in this scope
/home/vistausss/Downloads/blakjak/blakjak.cpp: At global scope:
/home/vistausss/Downloads/blakjak/blakjak.cpp:244: error: ‘KCardInfo’ does not name a type
/home/vistausss/Downloads/blakjak/blakjak.cpp:260: error: ‘KCardInfo’ was not declared in this scope
/home/vistausss/Downloads/blakjak/blakjak.cpp:260: error: template argument 1 is invalid
In file included from /usr/include/qt4/QtGui/qgraphicsitem.h:45,
from /usr/include/qt4/QtGui/QGraphicsItem:1,
from /usr/include/KDE/Plasma/../../plasma/applet.h:25,
from /usr/include/KDE/Plasma/Applet:1,
from /home/vistausss/Downloads/blakjak/blakjak.h:22,
from /home/vistausss/Downloads/blakjak/blakjak.cpp:19:
/usr/include/qt4/QtCore/qglobal.h: In instantiation of ‘QForeachContainer<int>’:
/home/vistausss/Downloads/blakjak/blakjak.cpp:265: instantiated from here
/usr/include/qt4/QtCore/qglobal.h:2246: error: ‘int’ is not a class, struct, or union type
/usr/include/qt4/QtCore/qglobal.h:2246: error: ‘int’ is not a class, struct, or union type
/home/vistausss/Downloads/blakjak/blakjak.cpp: In static member function ‘static quint8 blaKjaK::score(int)’:
/home/vistausss/Downloads/blakjak/blakjak.cpp:265: error: ‘class QForeachContainer<int>’ has no member named ‘i’
/home/vistausss/Downloads/blakjak/blakjak.cpp:265: error: ‘class QForeachContainer<int>’ has no member named ‘e’
/home/vistausss/Downloads/blakjak/blakjak.cpp:265: error: ‘class QForeachContainer<int>’ has no member named ‘i’
/home/vistausss/Downloads/blakjak/blakjak.cpp:265: error: ‘KCardInfo’ was not declared in this scope
/home/vistausss/Downloads/blakjak/blakjak.cpp:265: error: expected ‘;’ before ‘card’
/home/vistausss/Downloads/blakjak/blakjak.cpp:267: error: ‘card’ was not declared in this scope
/home/vistausss/Downloads/blakjak/blakjak.cpp:267: error: ‘KCardInfo’ is not a class or namespace
/home/vistausss/Downloads/blakjak/blakjak.cpp:268: error: ‘KCardInfo’ is not a class or namespace
/home/vistausss/Downloads/blakjak/blakjak.cpp:269: error: ‘KCardInfo’ is not a class or namespace
/home/vistausss/Downloads/blakjak/blakjak.cpp:284: error: request for member ‘size’ in ‘cards’, which is of non-class type ‘int’
In file included from /usr/include/qt4/QtGui/qgraphicsitem.h:45,
from /usr/include/qt4/QtGui/QGraphicsItem:1,
from /usr/include/KDE/Plasma/../../plasma/applet.h:25,
from /usr/include/KDE/Plasma/Applet:1,
from /home/vistausss/Downloads/blakjak/blakjak.h:22,
from /home/vistausss/Downloads/blakjak/blakjak.cpp:19:
/usr/include/qt4/QtCore/qglobal.h: In constructor ‘QForeachContainer<T>::QForeachContainer(const T&) [with T = int]’:
/home/vistausss/Downloads/blakjak/blakjak.cpp:265: instantiated from here
/usr/include/qt4/QtCore/qglobal.h:2243: error: using invalid field ‘QForeachContainer<T>::i’
/usr/include/qt4/QtCore/qglobal.h:2243: error: request for member ‘begin’ in ‘((QForeachContainer<int>*)this)->QForeachContainer<int>::c’, which is of non-class type ‘const int’
/usr/include/qt4/QtCore/qglobal.h:2243: error: using invalid field ‘QForeachContainer<T>::e’
/usr/include/qt4/QtCore/qglobal.h:2243: error: request for member ‘end’ in ‘((QForeachContainer<int>*)this)->QForeachContainer<int>::c’, which is of non-class type ‘const int’
make[2]: *** [CMakeFiles/plasma_applet_blakjak.dir/blakjak.o] Fout 1
make[1]: *** [CMakeFiles/plasma_applet_blakjak.dir/all] Fout 2
make: *** [all] Fout 2
vistausss@vistausss-laptop:~/Downloads/blakjak/build$

What can the problem be?


Posted by Vistausss.
Reply to this

Add commentBack






-
-
How do you like Plasma 5?
 The best KDE Desktop ever.
 Definitely a nice improvement.
 Not decided yet. Haven't tried it yet.
 I do not like some of the changes.
 KDE is taking the wrong way.
 I am still sticking with KDE 3.5.
 I have no opinion, but wanted to vote anyway.

resultmore
 
 
 Who we are
Contact
More about us
Frequently Asked Questions
Register
Twitter
Blog
Explore
Apps
Jobs
Knowledge
Events
People
Updates on identi.ca
Updates on Twitter
Facebook App
Content RSS   
Events RSS   

Participate
Groups
Forum
Add App
Public API
About KDE-Apps.org
Legal Notice
Spreadshirt Shop
CafePress Shop
Advertising
Sponsor us
Report Abuse
 

Copyright 2003-2014 KDE-Apps.org Team  
All rights reserved. KDE-Apps.org is not liable for any content or goods on this site.
All contributors are responsible for the lawfulness of their uploads.
KDE and K Desktop Environment are trademarks of KDE e.V.