-
 KDE-Apps.org Applications for the KDE-Desktop 
 GTK-Apps.org Applications using the GTK Toolkit 
 GnomeFiles.org Applications for GNOME 
 MeeGo-Central.org Applications for MeeGo 
 CLI-Apps.org Command Line Applications 
 Qt-Apps.org Free Qt Applications 
 Qt-Prop.org Proprietary Qt Applications 
 Maemo-Apps.org Applications for the Maemo Plattform 
 Java-Apps.org Free Java Applications 
 eyeOS-Apps.org Free eyeOS Applications 
 Wine-Apps.org Wine Applications 
 Server-Apps.org Server Applications 
 apps.ownCloud.com ownCloud Applications 
--
-
 KDE-Look.org Artwork for the KDE-Desktop 
 GNOME-Look.org Artwork for the GNOME-Desktop 
 Xfce-Look.org Artwork for the Xfce-Desktop 
 Box-Look.org Artwork for your Windowmanager 
 E17-Stuff.org Artwork for Enlightenment 
 Beryl-Themes.org Artwork for the Beryl Windowmanager 
 Compiz-Themes.org Artwork for the Compiz Windowmanager 
 EDE-Look.org Themes for your EDE Desktop 
--
-
 Debian-Art.org Stuff for Debian 
 Gentoo-Art.org Artwork for Gentoo Linux 
 SUSE-Art.org Artwork for openSUSE 
 Ubuntu-Art.org Artwork for Ubuntu 
 Kubuntu-Art.org Artwork for Kubuntu 
 LinuxMint-Art.org Artwork for Linux Mint 
 Arch-Stuff.org Art And Stuff for Arch Linux 
 Frugalware-Art.org Themes for Frugalware 
 Fedora-Art.org Artwork for Fedora Linux 
 Mandriva-Art.org Artwork for Mandriva Linux 
--
-
 KDE-Files.org Files for KDE Applications 
 OpenTemplate.org Documents for OpenOffice.org
 GIMPStuff.org Files for GIMP
 InkscapeStuff.org Files for Inkscape
 ScribusStuff.org Files for Scribus
 BlenderStuff.org Textures and Objects for Blender
 VLC-Addons.org Themes and Extensions for VLC
--
-
 KDE-Help.org Support for your KDE Desktop 
 GNOME-Help.org Support for your GNOME Desktop 
 Xfce-Help.org Support for your Xfce Desktop 
--
openDesktop.orgopenDesktop.org:   Applications   Artwork   Linux Distributions   Documents    LinuxDaily.com    Linux42.org    OpenSkillz.com   
 
Apps
News
Groups
Knowledge
Events
Forum
People
Jobs
Register
Login


Sponsoring


-
- Content .- Fans (26) .- Knowledge Base  . 

RecordItNow

   0.8.1  

KDE Video Application

Score 88%
RecordItNow
zoom


RecordItNow
zoom


RecordItNow
zoom


Homepage:  Link
Minimum required   KDE 4.x
Downloads:  4666
Submitted:  Oct 30 2009
Updated:  Mar 5 2010

Description:

RecordItNow is a plugin based desktop recorder for KDE

recorditnow-0.8 depends on KDE-4.4


#### dependencies ####
recordmydesktop (tested with recordmydesktop-0.3.8.1)
KDE-4.4
Joschy(joschy-snapshot-23-02-10 attached)

Optional:
ffmepg for ffmpeg encoder/recorder plugin
mencoder (part of mplayer) for mencoder encoder plugin
xfixes for mouse cursor in screenshots/zoom


#### INSTALL ####
tar -xvjpf recorditnow-0.8.1.tar.bz2
cd recorditnow-0.8.1
sudo sh install.sh


#### git ####
http://gitorious.org/recorditnow




Changelog:

12.08.2010:
makes life easier for packagers (rename GPLV2 to COPYING, buildin joschy)

05.03.2010: Release 0.8
New: Keyboard monitor
New: ffmpeg-recorder
New lib for uploads: Joschy
some new config options
Improved gui
Improved zoom
Many "under the hood" improvements
some bug fixes


22.12.2009: release 0.7
KAuth support
improved frame
new: circle under the mouse cursor
updated fr translation, thanks to Sébastien Vrillaud
updated hu translation, thanks to Barcza Károly
Some fixes
UI stuff

08.12.2009: release 0.6
Fix some little bugs
add french translation (thanks to Sébastien Vrillaud)
Fix some typos
new feature: Timeline
Improved mouse config
Improved recordmydesktop config (search)
Some krazy2 fixes
You can now select a mouse (recommended)
To fix the permissions, see http://recorditnow.sourceforge.net/#fix

29.11.2009: release 0.5
updated ebuilds
If you want to install the translations you need to specify them now for example with:
cmake -DLINGUAS="de hu"
add shortcuts config page
new features: zoom + show mouse clicks
Fix 2 little bugs in both uploader plugins
Fix cursor position on screenshot plugin


22.11.2009: release 0.4:
add tray overlay also in KDE-4.3
new default formats(ffmpeg/mencoder): wmv mpeg mkv
reset the timer after recording
ui stuff
new options for the screenshot plugin: quality/draw the mouse cursor/branding
new upload plugin: blip.tv
libgdata is now no longer required
bugfixes
Internal optimizations
new ebuilds

11.11.2009: add czech translation, thanks to Pavel Fric
10.11.2009: fix missing icon + update hu translation(thanks to VectoR)
10.11.2009: fix missing if in main.cpp
10.11.2009: Release 0.3:
new ebuilds
fix a crash that occurred after editing the toolbar
fix a leak
ui stuff
add shortcuts
add play/open and delete button
save the time and frame size
add upload plugin youtube
the timer can now be paused and stopped
add encoder plugins: ffmpeg and mencoder
add Portuguese (Brazil) translation, thanks to Márcio Moraes
fix workdir config
HIG stuff
fix start if session management is enabled

01.11.2009: fix header
01.11.2009: replace Experimental tray with KSystemtrayIcon on kde-4.3 (LibKNotificationItem-1.cmake is not installed by default)
31.10.2009: fix ld on KDE-4.3
31.10.2009: add translation (hu), fix build, HIG
31.10.2009: fix build with KDE-4.3
30.10.2009: Release 0.1




LicenseGPL
(source 0.8.1)
(blackPanther OS, and other RPM based distributions)
Donate
Send to a friend
Subscribe
Other  Apps  from justi
Report inappropriate content



goto page:  1  2  3  4  5  6  7  8 

-
.

 cmake trouble

 
 by DjNeophyte on: Oct 30 2009
 
Score 50%

Hi man,i get this trouble in cmake operation :
CMake Error at /usr/share/cmake-2.6/Modules/FindKDE4.cmake:84 (MESSAGE):
ERROR: cmake/modules/FindKDE4Internal.cmake not found in
/home/dve/.kde/share/apps;/usr/share/kubuntu-default-settings/kde4-profile/default/share/apps;/usr/share/kde4/apps
Call Stack (most recent call first):
CMakeLists.txt:3 (find_package)


CMake Warning (dev) in CMakeLists.txt:
No cmake_minimum_required command is present. A line of code such as

cmake_minimum_required(VERSION 2.6)

how can i fix it? Sorry for my poor englis


Reply to this

-

 Re: cmake trouble

 
 by justi on: Oct 30 2009
 
Score 50%

you need the kde headers to compile recorditnow.

it should be "kdebase-dev" on kubuntu (not sure, maybe you need more)


Reply to this

-

 Re: cmake trouble

 
 by DjNeophyte on: Oct 31 2009
 
Score 50%

Ok,cmake is done.But in the make session i've got this error :


/home/dve/recorditnow/src/mainwindow.cpp: In member function ‘void MainWindow::setupTray()’:
/home/dve/recorditnow/src/mainwindow.cpp:456: error: ‘KNotificationItem’ has not been declared
/home/dve/recorditnow/src/mainwindow.cpp:457: error: ‘KNotificationItem’ has not been declared
make[2]: *** [src/CMakeFiles/recorditnow.dir/mainwindow.o] Errore 1
make[1]: *** [src/CMakeFiles/recorditnow.dir/all] Errore 2
make: *** [all] Errore 2


Reply to this

-

 Error Building

 
 by swiftscythe on: Oct 31 2009
 
Score 50%

Hi! I get this error when trying to build from source:

[ 59%] Building CXX object src/CMakeFiles/recorditnow.dir/mainwindow.o
/home/swiftscythe/abs/recorditnow/src/recorditnow-0.1/src/mainwindow.cpp:45:31: error: knotificationitem.h: No such file or directory
[ 62%] Building CXX object src/CMakeFiles/recorditnow.dir/framebox.o

Thanks in advance!


Reply to this

-

 Re: Error Building

 
 by justi on: Oct 31 2009
 
Score 50%

KDE version?


Reply to this

-

 Re: Re: Error Building

 
 by swiftscythe on: Oct 31 2009
 
Score 50%

Oh Sorry, I'm on kde 4.3.2 Arch64 :)


Reply to this

-

 Re: Re: Re: Error Building

 
 by justi on: Oct 31 2009
 
Score 50%

ok it should build now.
thanks for report


Reply to this

-

 Re: Re: Re: Re: Error Building

 
 by swiftscythe on: Oct 31 2009
 
Score 50%

Oh I get this error now :S

[ 59%] Building CXX object src/CMakeFiles/recorditnow.dir/mainwindow.o
/home/swiftscythe/abs/recorditnow/src/recorditnow-0.1.1/src/mainwindow.cpp:48:62: error: experimental/knotificationitem/knotificationitem.h: No such file or directory
[ 62%] Building CXX object src/CMakeFiles/recorditnow.dir/framebox.o

Sorry!


Reply to this

-

 Re: Re: Re: Re: Re: Error Building

 
 by justi on: Oct 31 2009
 
Score 50%

install kdelibs-experimental
but download again please... forgot to add the namespace


Reply to this

-

 Re: Re: Re: Re: Re: Re: Error Building

 
 by swiftscythe on: Oct 31 2009
 
Score 50%

I already have kdelibs-experimental.
I've redownloaded the file and now I get this:

[ 53%] Building CXX object src/plugins/recorder/recordmydesktop/CMakeFiles/recorditnow_recordmydesktop_config.dir/recordmydesktop.o
In file included from /home/swiftscythe/abs/recorditnow/src/recorditnow-0.1.1/build/src/moc_mainwindow.cpp:10,
from /home/swiftscythe/abs/recorditnow/src/recorditnow-0.1.1/build/src/recorditnow_automoc.cpp:6:
/home/swiftscythe/abs/recorditnow/src/recorditnow-0.1.1/build/src/../../src/mainwindow.h:63: error: ‘Experimental’ has not been declared
/home/swiftscythe/abs/recorditnow/src/recorditnow-0.1.1/build/src/../../src/mainwindow.h:63: error: ISO C++ forbids declaration of ‘KNotificationItem’ with no type
/home/swiftscythe/abs/recorditnow/src/recorditnow-0.1.1/build/src/../../src/mainwindow.h:63: error: expected ‘;’ before ‘*’ token
make[2]: *** [src/CMakeFiles/recorditnow.dir/recorditnow_automoc.o] Error 1
make[1]: *** [src/CMakeFiles/recorditnow.dir/all] Error 2
make[1]: *** Waiting for unfinished jobs....
Linking CXX shared module ../../../../lib/recorditnow_recordmydesktop_config.so

:(



-

 Re: Re: Re: Re: Re: Re: Error Building

 
 by swiftscythe on: Nov 1 2009
 
Score 50%

Hi again! Now I get this error:

-- Found Qt-Version 4.5.3 (using /usr/bin/qmake)
-- Found X11: /usr/lib/libX11.so
-- Phonon Version: 4.3.1
-- Found KDE 4.3 include dir: /usr/include
-- Found KDE 4.3 library dir: /usr/lib
-- Found the KDE4 kconfig_compiler preprocessor: /usr/bin/kconfig_compiler
-- Found automoc4: /usr/bin/automoc4
CMake Error at src/CMakeLists.txt:5 (find_package):
Could not find module FindLibKNotificationItem-1.cmake or a configuration
file for package LibKNotificationItem-1.

Adjust CMAKE_MODULE_PATH to find FindLibKNotificationItem-1.cmake or set
LibKNotificationItem-1_DIR to the directory containing a CMake
configuration file for LibKNotificationItem-1. The file will have one of
the following names:

LibKNotificationItem-1Config.cmake
libknotificationitem-1-config.cmake

:( What's missing??



-

 Re: Re: Re: Re: Re: Re: Error Building

 
 by justi on: Nov 1 2009
 
Score 50%

install the package wich contains the file FindLibKNotificationItem-1.cmake

it is a part of kdebase/runtime/cmake



-

 Re: Re: Error Building

 
 by VectoR on: Oct 31 2009
 
Score 50%
VectoRVectoR
blackPanther Europe Ltd.
Home
-
Charles Barcza -20

blackPanther Europe Ltd.
United Kingdom, London or Budapest
Last visit Nov 6 2014
0 Friends
1 Groups

More info
Send a message
Add as friend
Other contents
--

for me similar build error in KDE-4.3.1 , unfortunately not enough this solution to missed header problem:

--- mainwindow.cpp.orig 2009-10-30 17:59:05.000000000 +0100
+++ mainwindow.cpp 2009-10-31 10:38:56.000000000 +0100
@@ -42,7 +42,7 @@
#include
#include
#include
-#include
+#include
#include
#include
#include

but because of that available the initial, untested Hungarian translation here: http://www.blackpanther.hu/~vector/src/apps/recorditnow.tar.bz2 for recorditnow


Reply to this

-

 Re: Re: Re: Error Building

 
 by VectoR on: Oct 31 2009
 
Score 50%
VectoRVectoR
blackPanther Europe Ltd.
Home
-
Charles Barcza -20

blackPanther Europe Ltd.
United Kingdom, London or Budapest
Last visit Nov 6 2014
0 Friends
1 Groups

More info
Send a message
Add as friend
Other contents
--

:) F@ck :D)
Fixed:
- <knotificationitem.h>
+ <knotificationitem-1/knotificationitem.h>


Reply to this

-

 Re: Re: Re: Re: Error Building

 
 by justi on: Oct 31 2009
 
Score 50%

ahhh thanks for help :-)


Reply to this

-

 Re: Re: Re: Re: Re: Error Building

 
 by justi on: Oct 31 2009
 
Score 50%

and big thanks for translation


Reply to this

-

 Re: Re: Re: Re: Re: Re: Error

 
 by justi on: Oct 31 2009
 
Score 50%

sorry please try again...


Reply to this

-

 Got an error

 
 by marcosRz on: Oct 31 2009
 
Score 50%

Arch x86 KDE 4.3

[ 12%] Building CXX object src/CMakeFiles/recorditnow.dir/mainwindow.o
/tmp/yaourt-tmp-marcos/aur-recorditnow/recorditnow/src/recorditnow-0.1/src/mainwindow.cpp:45:31: error: knotificationitem.h: Arquivo ou diretório não encontrado
/tmp/yaourt-tmp-marcos/aur-recorditnow/recorditnow/src/recorditnow-0.1/src/mainwindow.cpp: In destructor ‘virtual MainWindow::~MainWindow()’:
/tmp/yaourt-tmp-marcos/aur-recorditnow/recorditnow/src/recorditnow-0.1/src/mainwindow.cpp:118: warning: possible problem detected in invocation of delete operator:
/tmp/yaourt-tmp-marcos/aur-recorditnow/recorditnow/src/recorditnow-0.1/src/mainwindow.cpp:118: warning: invalid use of incomplete type ‘struct KNotificationItem’
/tmp/yaourt-tmp-marcos/aur-recorditnow/recorditnow/src/recorditnow-0.1/src/mainwindow.h:34: warning: forward declaration of ‘struct KNotificationItem’
/tmp/yaourt-tmp-marcos/aur-recorditnow/recorditnow/src/recorditnow-0.1/src/mainwindow.cpp:118: note: neither the destructor nor the class-specific operator delete will be called, even if they are declared when the class is defined.
/tmp/yaourt-tmp-marcos/aur-recorditnow/recorditnow/src/recorditnow-0.1/src/mainwindow.cpp: In member function ‘void MainWindow::setupTray()’:
/tmp/yaourt-tmp-marcos/aur-recorditnow/recorditnow/src/recorditnow-0.1/src/mainwindow.cpp:451: error: invalid use of incomplete type ‘struct KNotificationItem’
/tmp/yaourt-tmp-marcos/aur-recorditnow/recorditnow/src/recorditnow-0.1/src/mainwindow.h:34: error: forward declaration of ‘struct KNotificationItem’
/tmp/yaourt-tmp-marcos/aur-recorditnow/recorditnow/src/recorditnow-0.1/src/mainwindow.cpp:452: error: invalid use of incomplete type ‘struct KNotificationItem’
/tmp/yaourt-tmp-marcos/aur-recorditnow/recorditnow/src/recorditnow-0.1/src/mainwindow.h:34: error: forward declaration of ‘struct KNotificationItem’
/tmp/yaourt-tmp-marcos/aur-recorditnow/recorditnow/src/recorditnow-0.1/src/mainwindow.cpp:453: error: invalid use of incomplete type ‘struct KNotificationItem’
/tmp/yaourt-tmp-marcos/aur-recorditnow/recorditnow/src/recorditnow-0.1/src/mainwindow.h:34: error: forward declaration of ‘struct KNotificationItem’
/tmp/yaourt-tmp-marcos/aur-recorditnow/recorditnow/src/recorditnow-0.1/src/mainwindow.cpp:453: error: incomplete type ‘KNotificationItem’ used in nested name specifier
/tmp/yaourt-tmp-marcos/aur-recorditnow/recorditnow/src/recorditnow-0.1/src/mainwindow.cpp:454: error: invalid use of incomplete type ‘struct KNotificationItem’
/tmp/yaourt-tmp-marcos/aur-recorditnow/recorditnow/src/recorditnow-0.1/src/mainwindow.h:34: error: forward declaration of ‘struct KNotificationItem’
/tmp/yaourt-tmp-marcos/aur-recorditnow/recorditnow/src/recorditnow-0.1/src/mainwindow.cpp:454: error: incomplete type ‘KNotificationItem’ used in nested name specifier
/tmp/yaourt-tmp-marcos/aur-recorditnow/recorditnow/src/recorditnow-0.1/src/mainwindow.cpp:457: error: no matching function for call to ‘MainWindow::connect(KNotificationItem*&, const char [32], MainWindow* const, const char [28])’
/usr/include/QtCore/qobject.h:191: note: candidates are: static bool QObject::connect(const QObject*, const char*, const QObject*, const char*, Qt::ConnectionType)
/usr/include/QtCore/qobject.h:306: note: bool QObject::connect(const QObject*, const char*, const char*, Qt::ConnectionType) const
/tmp/yaourt-tmp-marcos/aur-recorditnow/recorditnow/src/recorditnow-0.1/src/mainwindow.cpp:468: error: invalid use of incomplete type ‘struct KNotificationItem’
/tmp/yaourt-tmp-marcos/aur-recorditnow/recorditnow/src/recorditnow-0.1/src/mainwindow.h:34: error: forward declaration of ‘struct KNotificationItem’
/tmp/yaourt-tmp-marcos/aur-recorditnow/recorditnow/src/recorditnow-0.1/src/mainwindow.cpp:472: warning: possible problem detected in invocation of delete operator:
/tmp/yaourt-tmp-marcos/aur-recorditnow/recorditnow/src/recorditnow-0.1/src/mainwindow.cpp:472: warning: invalid use of incomplete type ‘struct KNotificationItem’
/tmp/yaourt-tmp-marcos/aur-recorditnow/recorditnow/src/recorditnow-0.1/src/mainwindow.h:34: warning: forward declaration of ‘struct KNotificationItem’
/tmp/yaourt-tmp-marcos/aur-recorditnow/recorditnow/src/recorditnow-0.1/src/mainwindow.cpp:472: note: neither the destructor nor the class-specific operator delete will be called, even if they are declared when the class is defined.
/tmp/yaourt-tmp-marcos/aur-recorditnow/recorditnow/src/recorditnow-0.1/src/mainwindow.cpp: In member function ‘void MainWindow::setTrayOverlay(const QString&)’:
/tmp/yaourt-tmp-marcos/aur-recorditnow/recorditnow/src/recorditnow-0.1/src/mainwindow.cpp:484: error: invalid use of incomplete type ‘struct KNotificationItem’
/tmp/yaourt-tmp-marcos/aur-recorditnow/recorditnow/src/recorditnow-0.1/src/mainwindow.h:34: error: forward declaration of ‘struct KNotificationItem’
make[2]: ** [src/CMakeFiles/recorditnow.dir/mainwindow.o] Erro 1
make[1]: ** [src/CMakeFiles/recorditnow.dir/all] Erro 2
make: ** [all] Erro 2
==> ERRO: Compilação Falhou.


Reply to this

-

 Re: Got an error

 
 by justi on: Oct 31 2009
 
Score 50%

download version 0.1.1


Reply to this

-

 Re: Re: Got an error

 
 by marcosRz on: Oct 31 2009
 
Score 50%

Got same error download the source from here... :(


Reply to this

-

 Re: Re: Re: Got an error

 
 by justi on: Oct 31 2009
 
Score 50%

please post the cmake + make log


Reply to this

-

 Re: Re: Re: Re: Got an error

 
 by marcosRz on: Oct 31 2009
 
Score 50%

[marcos@pandora build]$ cmake -DCMAKE_INSTALL_PREFIX=`kde4-config --prefix` -DCMAKE_BUILD_TYPE=debugfull ../
-- The C compiler identification is GNU
-- The CXX compiler identification is GNU
-- Check for working C compiler: /usr/bin/gcc
-- Check for working C compiler: /usr/bin/gcc -- works
-- Detecting C compiler ABI info
-- Detecting C compiler ABI info - done
-- Check for working CXX compiler: /usr/bin/c++
-- Check for working CXX compiler: /usr/bin/c++ -- works
-- Detecting CXX compiler ABI info
-- Detecting CXX compiler ABI info - done
-- Looking for Q_WS_X11
-- Looking for Q_WS_X11 - found
-- Looking for Q_WS_WIN
-- Looking for Q_WS_WIN - not found.
-- Looking for Q_WS_QWS
-- Looking for Q_WS_QWS - not found.
-- Looking for Q_WS_MAC
-- Looking for Q_WS_MAC - not found.
-- Found Qt-Version 4.5.3 (using /usr/bin/qmake)
-- Looking for XOpenDisplay in /usr/lib/libX11.so;/usr/lib/libXext.so;/usr/lib/libXft.so;/usr/lib/libXau.so;/usr/lib/libXdmcp.so;/usr/lib/libXpm.so
-- Looking for XOpenDisplay in /usr/lib/libX11.so;/usr/lib/libXext.so;/usr/lib/libXft.so;/usr/lib/libXau.so;/usr/lib/libXdmcp.so;/usr/lib/libXpm.so - found
-- Looking for gethostbyname
-- Looking for gethostbyname - found
-- Looking for connect
-- Looking for connect - found
-- Looking for remove
-- Looking for remove - found
-- Looking for shmat
-- Looking for shmat - found
-- Looking for IceConnectionNumber in ICE
-- Looking for IceConnectionNumber in ICE - found
-- Found X11: /usr/lib/libX11.so
-- Looking for include files CMAKE_HAVE_PTHREAD_H
-- Looking for include files CMAKE_HAVE_PTHREAD_H - found
-- Looking for pthread_create in pthreads
-- Looking for pthread_create in pthreads - not found
-- Looking for pthread_create in pthread
-- Looking for pthread_create in pthread - found
-- Found Threads: TRUE
-- Found Automoc4: /usr/bin/automoc4
-- Found Perl: /usr/bin/perl
-- Phonon Version: 4.3.1
-- Found Phonon: /usr/lib/libphonon.so
-- Found Phonon Includes: /usr/include/KDE;/usr/include
-- Performing Test _OFFT_IS_64BIT
-- Performing Test _OFFT_IS_64BIT - Failed
-- Performing Test HAVE_FPIE_SUPPORT
-- Performing Test HAVE_FPIE_SUPPORT - Success
-- Performing Test __KDE_HAVE_W_OVERLOADED_VIRTUAL
-- Performing Test __KDE_HAVE_W_OVERLOADED_VIRTUAL - Success
-- Performing Test __KDE_HAVE_GCC_VISIBILITY
-- Performing Test __KDE_HAVE_GCC_VISIBILITY - Success
-- Found KDE 4.3 include dir: /usr/include
-- Found KDE 4.3 library dir: /usr/lib
-- Found the KDE4 kconfig_compiler preprocessor: /usr/bin/kconfig_compiler
-- Found automoc4: /usr/bin/automoc4
-- Configuring done
-- Generating done
-- Build files have been written to: /home/marcos/Softwares/recorditnow-0.1.1/build



[marcos@pandora build]$ make
Scanning dependencies of target translations
[ 0%] Built target translations
Scanning dependencies of target recorditnow_automoc
Generating moc_mainwindow.cpp
Generating moc_line.cpp
Generating moc_framebox.cpp
Generating moc_recorditnowpluginmanager.cpp
[ 0%] Built target recorditnow_automoc
Scanning dependencies of target recorditnow_recorder_automoc
Generating abstractrecorder.moc
[ 0%] Built target recorditnow_recorder_automoc
Scanning dependencies of target recorditnow_recorder
[ 3%] Building CXX object src/libs/recorder/CMakeFiles/recorditnow_recorder.dir/recorditnow_recorder_automoc.o
[ 6%] Building CXX object src/libs/recorder/CMakeFiles/recorditnow_recorder.dir/abstractrecorder.o
Linking CXX shared library ../../../lib/librecorditnow_recorder.so
[ 6%] Built target recorditnow_recorder
[ 9%] Generating recorditnow.h, recorditnow.cpp
[ 12%] Generating ui_toolbarwidget.h
[ 15%] Generating ui_settings.h
[ 18%] Generating ui_recorderplugins.h
Scanning dependencies of target recorditnow
[ 21%] Building CXX object src/CMakeFiles/recorditnow.dir/recorditnow_automoc.o
[ 25%] Building CXX object src/CMakeFiles/recorditnow.dir/main.o
[ 28%] Building CXX object src/CMakeFiles/recorditnow.dir/mainwindow.o
In file included from /home/marcos/Softwares/recorditnow-0.1.1/build/src/ui_toolbarwidget.h:1,
from /home/marcos/Softwares/recorditnow-0.1.1/src/mainwindow.h:24,
from /home/marcos/Softwares/recorditnow-0.1.1/src/mainwindow.cpp:21:
/usr/include/kdialog.h:27: error: expected constructor, destructor, or type conversion before ‘class’
In file included from /home/marcos/Softwares/recorditnow-0.1.1/build/src/ui_toolbarwidget.h:1,
from /home/marcos/Softwares/recorditnow-0.1.1/src/mainwindow.h:24,
from /home/marcos/Softwares/recorditnow-0.1.1/src/mainwindow.cpp:21:
/usr/include/kdialog.h:397: error: expected ‘;’ before ‘*’ token
/home/marcos/Softwares/recorditnow-0.1.1/src/mainwindow.cpp: In member function ‘void MainWindow::setupTray()’:
/home/marcos/Softwares/recorditnow-0.1.1/src/mainwindow.cpp:456: error: incomplete type ‘KNotificationItem’ used in nested name specifier
/home/marcos/Softwares/recorditnow-0.1.1/src/mainwindow.cpp:457: error: incomplete type ‘KNotificationItem’ used in nested name specifier
make[2]: ** [src/CMakeFiles/recorditnow.dir/mainwindow.o] Erro 1
make[1]: ** [src/CMakeFiles/recorditnow.dir/all] Erro 2
make: ** [all] Erro 2
[marcos@pandora build]$


Reply to this

-

 Re: Re: Re: Re: Re: Got an error

 
 by justi on: Oct 31 2009
 
Score 50%

something is wrong on your system, see:
/usr/include/kdialog.h:27: error: expected constructor, destructor, or type conversion before ‘class’


Reply to this

-
.

 Compilation problem

 
 by gohanz on: Oct 31 2009
 
Score 50%

I have a compilation problem on my Slackware 13.0 with KDE-4.2.4.


Scanning dependencies of target recorditnow
[ 21%] Building CXX object src/CMakeFiles/recorditnow.dir/recorditnow_automoc.o
In file included from /root/Downloads/recorditnow-0.1.1/build/src/moc_mainwindow.cpp:10,
from /root/Downloads/recorditnow-0.1.1/build/src/recorditnow_automoc.cpp:7:
/root/Downloads/recorditnow-0.1.1/build/src/../../src/mainwindow.h:35:51: error: knotificationitem-1/knotificationitem.h: No such file or directory
In file included from /root/Downloads/recorditnow-0.1.1/build/src/../../src/mainwindow.h:24,
from /root/Downloads/recorditnow-0.1.1/build/src/moc_mainwindow.cpp:10,
from /root/Downloads/recorditnow-0.1.1/build/src/recorditnow_automoc.cpp:7:
/root/Downloads/recorditnow-0.1.1/build/src/ui_toolbarwidget.h: In member function ‘void Ui_ToolBarWidget::retranslateUi(QWidget*)’:
/root/Downloads/recorditnow-0.1.1/build/src/ui_toolbarwidget.h:210: error: ‘class KUrlRequester’ has no member named ‘setText’
In file included from /root/Downloads/recorditnow-0.1.1/build/src/moc_mainwindow.cpp:10,
from /root/Downloads/recorditnow-0.1.1/build/src/recorditnow_automoc.cpp:7:
/root/Downloads/recorditnow-0.1.1/build/src/../../src/mainwindow.h: At global scope:
/root/Downloads/recorditnow-0.1.1/build/src/../../src/mainwindow.h:70: error: ‘Experimental’ has not been declared
/root/Downloads/recorditnow-0.1.1/build/src/../../src/mainwindow.h:70: error: ISO C++ forbids declaration of ‘KNotificationItem’ with no type
/root/Downloads/recorditnow-0.1.1/build/src/../../src/mainwindow.h:70: error: expected ‘;’ before ‘*’ token
make[2]: *** [src/CMakeFiles/recorditnow.dir/recorditnow_automoc.o] Error 1
make[1]: *** [src/CMakeFiles/recorditnow.dir/all] Error 2
make: *** [all] Error 2


Reply to this

-

 Re: Compilation problem

 
 by justi on: Oct 31 2009
 
Score 50%

sorry KDE-4.2 is too old


Reply to this

-
.

 Re: Re: Compilation problem

 
 by gohanz on: Nov 1 2009
 
Score 50%

Many thanks for info.


Reply to this

-
.

 unable to compile karmic koala

 
 by nowardev on: Oct 31 2009
 
Score 50%

kde 4.3.2
recordmydestkop 0.3.8.1
kdebase-dev

no erros on cmake but then,,, with make


[ 37%] Generating ui_settings.h
[ 40%] Generating ui_recorderplugins.h
[ 43%] Building CXX object src/CMakeFiles/recorditnow.dir/recorditnow_automoc.o
In file included from /home/screencast/Documenti/recorditnow-0.2/build/src/moc_mainwindow.cpp:10,
from /home/screencast/Documenti/recorditnow-0.2/build/src/recorditnow_automoc.cpp:6:
/home/screencast/Documenti/recorditnow-0.2/build/src/../../src/mainwindow.h:35:51: error: knotificationitem-1/knotificationitem.h: Nessun file o directory
[ 46%] [ 50%] Building CXX object src/plugins/recorder/recordmydesktop/CMakeFiles/recorditnow_recordmydesktop_config.dir/recordmydesktopconfig.o
Building CXX object src/plugins/recorder/screenshot/CMakeFiles/recorditnow_screenshot_config.dir/screenshot.o
In file included from /home/screencast/Documenti/recorditnow-0.2/build/src/moc_mainwindow.cpp:10,
from /home/screencast/Documenti/recorditnow-0.2/build/src/recorditnow_automoc.cpp:6:
/home/screencast/Documenti/recorditnow-0.2/build/src/../../src/mainwindow.h:69: error: ‘Experimental’ has not been declared
/home/screencast/Documenti/recorditnow-0.2/build/src/../../src/mainwindow.h:69: error: ISO C++ forbids declaration of ‘KNotificationItem’ with no type
/home/screencast/Documenti/recorditnow-0.2/build/src/../../src/mainwindow.h:69: error: expected ‘;’ before ‘*’ token
make[2]: *** [src/CMakeFiles/recorditnow.dir/recorditnow_automoc.o] Errore 1
make[1]: *** [src/CMakeFiles/recorditnow.dir/all] Errore 2
make[1]: *** In attesa di lavori non terminati...
[ 53%] Building CXX object src/plugins/recorder/recordmydesktop/CMakeFiles/recorditnow_recordmydesktop_config.dir/recordmydesktop.o
Linking CXX shared module ../../../../lib/recorditnow_screenshot_config.so
[ 53%] Built target recorditnow_screenshot_config
Linking CXX shared module ../../../../lib/recorditnow_recordmydesktop_config.so
[ 53%] Built target recorditnow_recordmydesktop_config
make: *** [all] Errore 2


Reply to this

-

 Re: unable to compile karmic koala

 
 by justi on: Oct 31 2009
 
Score 50%

install kdelibs-experimental


Reply to this

-

 Re: Re: unable to compile karmic koala

 
 by nowardev on: Oct 31 2009
 
Score 50%

apt-cache search kdelibs
kdelibs - core libraries from the official KDE release
kdelibs-bin - executables for all KDE 4 core applications
kdelibs-data - core shared data for all KDE applications
kdelibs-dbg - debugging symbols for kdelibs
kdelibs4-dev - development files for the KDE core libraries
kdelibs4c2a - core libraries and binaries for all KDE applications
kdelibs5 - core libraries for all KDE 4 applications
kdelibs5-data - core shared data for all KDE 4 applications
kdelibs5-dbg - debugging symbols for the KDE 4 libraries module
kdelibs5-dev - development files for the KDE 4 core libraries
libkde3-java - kdelibs bindings for Java (KDE3)
libkde3-jni - kdelibs bindings for java ( Native libraries for KDE3 )


Reply to this

-

 Re: Re: Re: unable to compile karmic koala

 
 by nowardev on: Oct 31 2009
 
Score 50%

and kdelibs5-dev is already installed


Reply to this

-

 Re: Re: Re: unable to compile karmic koala

 
 by justi on: Oct 31 2009
 
Score 50%

https://launchpad.net/ubuntu/+source/kdelibs-experimental


Reply to this

-

 Re: Re: Re: Re: unable to compile karmic koala

 
 by nowardev on: Oct 31 2009
 
Score 50%

i need to add external repository?

i can't find it on normal repository, i have all the normal stuff ..+ some external repository ...

anyway you seem pretty sure so if it's this the problem i will investigate thank you


Reply to this

-

 Re: Re: Re: Re: Re: unable to compile karmic koala

 
 by justi on: Oct 31 2009
 
Score 50%

>> i need to add external repository?
i don`t know... kdelibs-experimantal is a part of KDE-4.3 and is used in kmix for example


Reply to this

goto page:  1  2  3  4  5  6  7  8 

Add commentBack






-
-
How do you like Plasma 5?
 The best KDE Desktop ever.
 Definitely a nice improvement.
 Not decided yet. Haven't tried it yet.
 I do not like some of the changes.
 KDE is taking the wrong way.
 I am still sticking with KDE 3.5.
 I have no opinion, but wanted to vote anyway.

resultmore
 
 
 Who we are
Contact
More about us
Frequently Asked Questions
Register
Twitter
Blog
Explore
Apps
Jobs
Knowledge
Events
People
Updates on identi.ca
Updates on Twitter
Facebook App
Content RSS   
Events RSS   

Participate
Groups
Forum
Add App
Public API
About KDE-Apps.org
Legal Notice
Spreadshirt Shop
CafePress Shop
Advertising
Sponsor us
Report Abuse
 

Copyright 2003-2014 KDE-Apps.org Team  
All rights reserved. KDE-Apps.org is not liable for any content or goods on this site.
All contributors are responsible for the lawfulness of their uploads.
KDE and K Desktop Environment are trademarks of KDE e.V.