-
 KDE-Apps.org Applications for the KDE-Desktop 
 GTK-Apps.org Applications using the GTK Toolkit 
 GnomeFiles.org Applications for GNOME 
 MeeGo-Central.org Applications for MeeGo 
 CLI-Apps.org Command Line Applications 
 Qt-Apps.org Free Qt Applications 
 Qt-Prop.org Proprietary Qt Applications 
 Maemo-Apps.org Applications for the Maemo Plattform 
 Java-Apps.org Free Java Applications 
 eyeOS-Apps.org Free eyeOS Applications 
 Wine-Apps.org Wine Applications 
 Server-Apps.org Server Applications 
 apps.ownCloud.com ownCloud Applications 
--
-
 KDE-Look.org Artwork for the KDE-Desktop 
 GNOME-Look.org Artwork for the GNOME-Desktop 
 Xfce-Look.org Artwork for the Xfce-Desktop 
 Box-Look.org Artwork for your Windowmanager 
 E17-Stuff.org Artwork for Enlightenment 
 Beryl-Themes.org Artwork for the Beryl Windowmanager 
 Compiz-Themes.org Artwork for the Compiz Windowmanager 
 EDE-Look.org Themes for your EDE Desktop 
--
-
 Debian-Art.org Stuff for Debian 
 Gentoo-Art.org Artwork for Gentoo Linux 
 SUSE-Art.org Artwork for openSUSE 
 Ubuntu-Art.org Artwork for Ubuntu 
 Kubuntu-Art.org Artwork for Kubuntu 
 LinuxMint-Art.org Artwork for Linux Mint 
 Arch-Stuff.org Art And Stuff for Arch Linux 
 Frugalware-Art.org Themes for Frugalware 
 Fedora-Art.org Artwork for Fedora Linux 
 Mandriva-Art.org Artwork for Mandriva Linux 
--
-
 KDE-Files.org Files for KDE Applications 
 OpenTemplate.org Documents for OpenOffice.org
 GIMPStuff.org Files for GIMP
 InkscapeStuff.org Files for Inkscape
 ScribusStuff.org Files for Scribus
 BlenderStuff.org Textures and Objects for Blender
 VLC-Addons.org Themes and Extensions for VLC
--
-
 KDE-Help.org Support for your KDE Desktop 
 GNOME-Help.org Support for your GNOME Desktop 
 Xfce-Help.org Support for your Xfce Desktop 
--
openDesktop.orgopenDesktop.org:   Applications   Artwork   Linux Distributions   Documents    LinuxDaily.com    Linux42.org    OpenSkillz.com   
 
Apps
News
Groups
Knowledge
Events
Forum
People
Jobs
Register
Login


Sponsoring


-
- Content .- Fans (12) .- Knowledge Base  . 

Semantik

   0.9.1  

KDE Education

Score 81%
Semantik
zoom


Semantik
zoom


Semantik
zoom


Link:  Link
Minimum required   KDE 4.x
Downloads:  9692
Submitted:  Mar 26 2007
Updated:  Jan 14 2014

Description:

Semantik - a mindmapping-like tool for document generation (reports, thesis, etc).

The requirements are:

Runtime:
KDE4 >= 4.8
Python >= 2.3 && Python < 3.0

Compilation:
KDE4 development packages (kdebase-devel)
Python2 development package
The objective caml compilers (ocaml)
The program kde4-config in the PATH

Some systems may require special compilation options such as:
PYTHON=python2 PYTHON_VERSION=2.7 waf configure build




Changelog:

Semantik 0.9.1
--------------
* Svg map export
* Odt template fixes
* Include svg pictures in odt documents
* command-line svg export
* More reasonable size for the actors head
* Prevent the memory corruption when opening the same recent file again
* Make the text visible in the odt document created (Issue 27)
* fixed the diagram top/bottom alignment function
* Copy diagram pictures to clipboard from main window
* Copy diagrams to the clipboard

Semantik 0.9.0
--------------
* New application for editing and managing diagrams
* Enhanced printing system from the menu
* Print diagrams from the command-line
* Fixed the jitter on the drawing area

Semantik 0.8.4
--------------
* Export maps to pdf pictures from the command-line
* Color scheme fixes #30
* Null byte fix for text pasted from Chrome #26

Semantik 0.8.3
--------------
* New dialog for exporting the map as a picture with a specific size
* More consistent gui elements (dialog buttons, menus)
* New UML shapes
* Straight arrows on the diagrams

Semantik 0.8.2
--------------
* Fixed several crashes
* Fixe various LaTeX templates
* New actor and usecase elements




LicenseGPL
(semantik)
Send to a friend
Subscribe
Other  Apps  from ita256
Report inappropriate content



goto page: prev   1  2  3  4  5  6  7  8  9 

-
.

 Install problem

 
 by Lexje on: Oct 26 2007
 
Score 50%

Hi,

I'm trying to install on SuSE 10.1;
I get following error:
Configuration finished successfully; project is now ready to build.
erwin@precision1:~/mnt_apen1_erwin/rpm/semantik/semantik2/semantik-0.5.8> ./waf
Traceback (most recent call last):
File "/home/erwin/mnt_apen1_erwin/rpm/semantik/semantik2/semantik-0.5.8/waf", line 345, in ?
try: Scripting.Main()
File "/home/erwin/mnt_apen1_erwin/rpm/semantik/semantik2/semantik-0.5.8/.waf-1.2.0-1940321410/wafadmin/Scripting.py", line 144, in Main
ret = bld.compile()
File "/home/erwin/mnt_apen1_erwin/rpm/semantik/semantik2/semantik-0.5.8/.waf-1.2.0-1940321410/wafadmin/Build.py", line 92, in compile
ret = executor.start()
File "/home/erwin/mnt_apen1_erwin/rpm/semantik/semantik2/semantik-0.5.8/.waf-1.2.0-1940321410/wafadmin/Runner.py", line 123, in start
if not tsk.may_start():
File "/home/erwin/mnt_apen1_erwin/rpm/semantik/semantik2/semantik-0.5.8/.waf-1.2.0-1940321410/wafadmin/Tools/qt4.py", line 49, in may_start
m_node = h_node.change_ext('.moc')
AttributeError: 'NoneType' object has no attribute 'change_ext'
erwin@precision1:~/mnt_apen1_erwin/rpm/semantik/semantik2/semantik-0.5.8>

How can I solve this please?
Thank you,

Erwin


Reply to this

-
.

 feature suggestion

 
 by blurymind on: Nov 5 2007
 
Score 50%

grab screen zone (screenshot) after x seconds and import it as image data.


...and May the source be with you.. @655
Reply to this

-
.

 Errors on configure

 
 by DanaKil on: Feb 7 2008
 
Score 50%

Hello :-)

I have installed KDE4 with the Kubuntu packages (installed in /usr/lib/kde4) and I can compile programs with KDevelop, but for Semantik, configure is stuck here :
...
...
Checking for program kde4-config:ok
/usr/lib/kde4/bin/kde4-config
Semantik requires kde4

It's the same when I use prefix="/usr/lib/kde4"

Any idea ?


Reply to this

-
.

 Re: Errors on configure

 
 by DanaKil on: Feb 8 2008
 
Score 50%

Well, I've installed the Ubuntu Hardy package of semantik (I use Gutsy) and all seems to work fine

I really like this way of creating my big documents but I miss one thing : embed parts of formated (or not) text from an external file.

So, when I create my hierarchy, I can create for example a "Introduction" or a "bibliography" node and link this node to "myintroduction.odf" or "mybibliography.odf".

When I export my document so that it can be opened in oOo, my external files are inserted directly in the generated file.
This way I can divise my work into several small files.


Reply to this

-

 Re: Errors on configure

 
 by LinAsH on: Feb 14 2008
 
Score 50%

Hello,

From the 0.6.5 version (http://freehackers.org/~tnagy/semantik-0.6.5.tar.bz2) and some patching I got it running on Ubuntu Hardy.

The resulting deb can be downloaded at :
http://jb.giraudeau.info/apt/dists/hardy/main/

There's also the modification have made in the diff file.

(And since the 0.6.5 has not be relased officialy, don't complain to the author)


Reply to this

-

 Re: Re: Errors on configure

 
 by DanaKil on: Feb 14 2008
 
Score 50%

thank you for your reply, I will test your deb, but as I said, the stable hardy package seems to works on my gutsy out of the box

anyways, thank you :)


Reply to this

-

 debug... not found

 
 by BryanFRitt on: Mar 6 2008
 
Score 50%

I tried to install this on kubuntu 7.10 64 bit.
I get stuck at this point when trying to run
./waf configure
every thing else results in ok.
I noticed that the same ones say ok, if there isn't a _debug at the end.
Is there something(s) that I need to install?
-
./waf configure
...
Checking for package Qt3Support_debug : not found
Checking for package QtCore_debug : not found
Checking for package QtGui_debug : not found
Checking for package QtNetwork_debug : not found
Checking for package QtOpenGL_debug : not found
Checking for package QtSql_debug : not found
Checking for package QtSvg_debug : not found
Checking for package QtTest_debug : not found
Checking for package QtXml_debug : not found
...
-------------------------------------------------------------------------------
./waf configure
You are using Linux, that's good (tm)
Checking for program g++ : ok /usr/bin/g++
Checking for program cpp : ok /usr/bin/cpp
Checking for program ar : ok /usr/bin/ar
Checking for program ranlib : ok /usr/bin/ranlib
Checking for compiler could create programs : ok
Checking for compiler could create shared libs : ok
Checking for compiler could create static libs : ok
Checking for flags -Wall : ok
Checking for flags -O2 : ok
Checking for flags -g -DDEBUG : ok
Checking for flags -g3 -O0 -DDEBUG : ok
Checking for program qmake-qt4 : ok /usr/bin/qmake-qt4
Checking for header QtGui/QFont : ok /usr/include/qt4
Checking for program uic-qt3 : ok /usr/bin/uic-qt3
Checking for program uic-qt4 : ok /usr/bin/uic-qt4
Checking for uic version : ok (version 4.3.2)
Checking for program moc-qt4 : ok /usr/bin/moc-qt4
Checking for program rcc : ok /usr/bin/rcc
Checking for program lrelease-qt4 : ok /usr/bin/lrelease-qt4
Checking for program lupdate-qt4 : ok /usr/bin/lupdate-qt4
Checking for package Qt3Support_debug : not found
Checking for package QtCore_debug : not found
Checking for package QtGui_debug : not found
Checking for package QtNetwork_debug : not found
Checking for package QtOpenGL_debug : not found
Checking for package QtSql_debug : not found
Checking for package QtSvg_debug : not found
Checking for package QtTest_debug : not found
Checking for package QtXml_debug : not found
Checking for package Qt3Support : ok
Checking for package QtCore : ok
Checking for package QtGui : ok
Checking for package QtNetwork : ok
Checking for package QtOpenGL : ok
Checking for package QtSql : ok
Checking for package QtSvg : ok
Checking for package QtTest : ok
Checking for package QtXml : ok
Checking for program python : ok /usr/bin/python
Checking for program ocamlopt : ok /usr/bin/ocamlopt
Checking for program ocamlc : ok /usr/bin/ocamlc
Checking for program ocamllex : ok /usr/bin/ocamllex
Checking for program ocamlyacc : ok /usr/bin/ocamlyacc
Checking for Python version >= 2.4.2 : ok 2.5.1
Checking for library python2.5 : ok
Checking for header Python.h : ok
Checking for program kde4-config : ok /usr/lib/kde4/bin/kde4-config
Semantik requires kde4


Reply to this

-

 Re: debug... not found

 
 by LinAsH on: Mar 6 2008
 
Score 50%

There is an updated semantik package in hardy, maybe it works with gutsy:
http://packages.ubuntu.com/hardy/amd64/semantik/download


Reply to this

-

 Re: Re: debug... not

 
 by BryanFRitt on: Mar 6 2008
 
Score 50%

The Package Installer gives me an error:

Error: Dependency is not satisfiable: libc6

According to Adept Manager libc6 is installed with version 2.6.1-1ubuntu10, and there are no upgrades available for it.


Reply to this

-
.

 0.6.6

 
 by bhlevca on: Mar 15 2008
 
Score 50%

This version cannot open .sem files generated by 0.6.4


Reply to this

-

 Re: 0.6.6

 
 by ita256 on: Mar 15 2008
 
Score 50%

The runtime problems haven been fixed in version 0.6.7.


Reply to this

-
.

 Re: Re: 0.6.6

 
 by bhlevca on: Mar 15 2008
 
Score 50%

0.6.7 does not compile. see errors below. Does this version have additional dependencies?

../src/IztKil.cpp:11:20: error: QtWebKit: No such file or directory
../src/IztKil.cpp: In constructor ‘egyklh::egyklh(QWidget*, jelzpn*)’:
../src/IztKil.cpp:33: error: invalid use of incomplete type ‘struct QWebView’
../src/IztKil.h:10: error: forward declaration of ‘struct QWebView’
../src/IztKil.cpp:34: error: no matching function for call to ‘egyklh::addWidget(QWebView*&)’
/usr/include/QtGui/QStackedWidget:67: note: candidates are: int QStackedWidget::addWidget(QWidget*)
../src/IztKil.cpp: In member function ‘void egyklh::kelt(const QHash<int, QVariant>&)’:
../src/IztKil.cpp:47: error: invalid use of incomplete type ‘struct QWebView’
../src/IztKil.h:10: error: forward declaration of ‘struct QWebView’
../src/IztKil.cpp:48: error: invalid use of incomplete type ‘struct QWebView’
../src/IztKil.h:10: error: forward declaration of ‘struct QWebView’
../src/IztKil.cpp:51: error: invalid use of incomplete type ‘struct QWebView’
../src/IztKil.h:10: error: forward declaration of ‘struct QWebView’
../src/IztKil.cpp:52: error: invalid use of incomplete type ‘struct QWebView’
../src/IztKil.h:10: error: forward declaration of ‘struct QWebView’
../src/IztKil.cpp:54: error: no matching function for call to ‘egyklh::setCurrentWidget(QWebView*&)’
/usr/include/QtGui/QStackedWidget:80: note: candidates are: void QStackedWidget::setCurrentWidget(QWidget*)
Build failed


Reply to this

-

 Re: Re: Re: 0.6.6

 
 by aleixpol on: Mar 15 2008
 
Score 50%

Qt4.4 is required and it seems you don't have it.


Reply to this

-

 Re: Re: Re: 0.6.6

 
 by LinAsH on: Mar 16 2008
 
Score 50%

Seams like some standard include files are missing in the qtwebkit debian dev package.
(I just reported a bug https://bugs.launchpad.net/ubuntu/+source/webkit/+bug/202644)

meanwhile the compilation error can be fixed:
at line 11 in src/IztKil.cpp
replace
"QtWebView"
with
"QtWebKit/qwebview.h"


Reply to this

-
.

 Re: Re: 0.6.6

 
 by bhlevca on: Mar 15 2008
 
Score 50%

0.6.7 does not compile. see errors below. Does this version have additional dependencies?

../src/IztKil.cpp:11:20: error: QtWebKit: No such file or directory
../src/IztKil.cpp: In constructor ‘egyklh::egyklh(QWidget*, jelzpn*)’:
../src/IztKil.cpp:33: error: invalid use of incomplete type ‘struct QWebView’
../src/IztKil.h:10: error: forward declaration of ‘struct QWebView’
../src/IztKil.cpp:34: error: no matching function for call to ‘egyklh::addWidget(QWebView*&)’
/usr/include/QtGui/QStackedWidget:67: note: candidates are: int QStackedWidget::addWidget(QWidget*)
../src/IztKil.cpp: In member function ‘void egyklh::kelt(const QHash<int, QVariant>&)’:
../src/IztKil.cpp:47: error: invalid use of incomplete type ‘struct QWebView’
../src/IztKil.h:10: error: forward declaration of ‘struct QWebView’
../src/IztKil.cpp:48: error: invalid use of incomplete type ‘struct QWebView’
../src/IztKil.h:10: error: forward declaration of ‘struct QWebView’
../src/IztKil.cpp:51: error: invalid use of incomplete type ‘struct QWebView’
../src/IztKil.h:10: error: forward declaration of ‘struct QWebView’
../src/IztKil.cpp:52: error: invalid use of incomplete type ‘struct QWebView’
../src/IztKil.h:10: error: forward declaration of ‘struct QWebView’
../src/IztKil.cpp:54: error: no matching function for call to ‘egyklh::setCurrentWidget(QWebView*&)’
/usr/include/QtGui/QStackedWidget:80: note: candidates are: void QStackedWidget::setCurrentWidget(QWidget*)
Build failed


Reply to this

-
.

 Re: Re: 0.6.6

 
 by bhlevca on: Mar 15 2008
 
Score 50%

0.6.7 does not compile. see errors below. Does this version have additional dependencies?

../src/IztKil.cpp:11:20: error: QtWebKit: No such file or directory
../src/IztKil.cpp: In constructor ‘egyklh::egyklh(QWidget*, jelzpn*)’:
../src/IztKil.cpp:33: error: invalid use of incomplete type ‘struct QWebView’
../src/IztKil.h:10: error: forward declaration of ‘struct QWebView’
../src/IztKil.cpp:34: error: no matching function for call to ‘egyklh::addWidget(QWebView*&)’
/usr/include/QtGui/QStackedWidget:67: note: candidates are: int QStackedWidget::addWidget(QWidget*)
../src/IztKil.cpp: In member function ‘void egyklh::kelt(const QHash<int, QVariant>&)’:
../src/IztKil.cpp:47: error: invalid use of incomplete type ‘struct QWebView’
../src/IztKil.h:10: error: forward declaration of ‘struct QWebView’
../src/IztKil.cpp:48: error: invalid use of incomplete type ‘struct QWebView’
../src/IztKil.h:10: error: forward declaration of ‘struct QWebView’
../src/IztKil.cpp:51: error: invalid use of incomplete type ‘struct QWebView’
../src/IztKil.h:10: error: forward declaration of ‘struct QWebView’
../src/IztKil.cpp:52: error: invalid use of incomplete type ‘struct QWebView’
../src/IztKil.h:10: error: forward declaration of ‘struct QWebView’
../src/IztKil.cpp:54: error: no matching function for call to ‘egyklh::setCurrentWidget(QWebView*&)’
/usr/include/QtGui/QStackedWidget:80: note: candidates are: void QStackedWidget::setCurrentWidget(QWidget*)
Build failed


Reply to this

-

 Re: Re: Re: 0.6.6

 
 by bhlevca on: Mar 15 2008
 
Score 50%

please remove the last 2 postings, I accidentally reposted by reloading the page. Sorry


Reply to this

-
.

 Re: Re: Re: Re: 0.6.6

 
 by ita256 on: Mar 16 2008
 
Score 50%

Comments cannot be removed


Reply to this

-

 0.6.7

 
 by dovidhalevi on: Mar 16 2008
 
Score 50%

Finally recognizes that I do indeed have kde4 -dev available.

However, the qtwebkit is not.


Reply to this

goto page: prev   1  2  3  4  5  6  7  8  9 

Add commentBack






-
-
Do you like or dislike Ubuntu Unity?
 Yes, unity is alien technology!
 It is less confusing than Gnome 3 default, shell.
 Granny thinks it is much more usable than Gnome 2
 Canonical is embarrasing itself with this split project
 Gnome 3 default shell is much better
 I dislike Unity, Gnome 3 default shell is alien technology!
 None of the above, I like the 2Gb for free and Apple alike behavior. Will post a comment instead

resultmore
 
 
 Who we are
Contact
More about us
Frequently Asked Questions
Register
Twitter
Blog
Explore
Apps
Jobs
Knowledge
Events
People
Updates on identi.ca
Updates on Twitter
Facebook App
Content RSS   
Events RSS   

Participate
Groups
Forum
Add App
Public API
About KDE-Apps.org
Legal Notice
Spreadshirt Shop
CafePress Shop
Advertising
Sponsor us
Report Abuse
 

Copyright 2003-2014 KDE-Apps.org Team  
All rights reserved. KDE-Apps.org is not liable for any content or goods on this site.
All contributors are responsible for the lawfulness of their uploads.
KDE and K Desktop Environment are trademarks of KDE e.V.